weak signals
type: Concept
in scheme: conceptscheme
related: futurology
preferred label: svaga signaler @sv
preferred label: heikot signaalit @fi
broader: societal phenomena
scope note: Sellainen ilmiö tai tapahtuma, joka ei välttämättä tapahtuessaan vaikuta tärkeältä, mutta jolla on tulevaisuuden kannalta tärkeä tai jopa ratkaiseva merkitys. Heikko signaali on ensimmäinen ilmaus muutoksesta tai se voi olla juuri se sysäys, joka muuttaa ratkaisevasti tapahtumien kulkua

futurology
type: Concept
preferred label: framtidsforskning @sv
preferred label: tulevaisuudentutkimus @fi
related: weak signals

societal phenomena
type: Concept
preferred label: yhteiskunnalliset ilmiöt @fi
narrower: weak signals