phenomenology
type: Concept
in scheme: conceptscheme
comment: Edmund Husserlin kehittämä filosofian suunta
comment: fil., psyk. ilmiöiden elämyksellisyyteen perustuva tutkimus [Kielitoimiston sanakirja]
broader: philosophy
preferred label: fenomenologi @sv
preferred label: fenomenologia @fi
narrower: religious phenomenology

philosophy
type: Concept
preferred label: filosofia @fi
preferred label: filosofi @sv
narrower: phenomenology

religious phenomenology
type: Concept
preferred label: uskontofenomenologia @fi
preferred label: religionsfenomenologi @sv
broader: phenomenology