projects
type: Concept
preferred label: projekt @sv
preferred label: projektit @fi
narrower: Federal Theatre Project

Federal Theatre Project
type: Concept
broader: projects
source: Lähde: Ojanen, R., Amerikkalaisen liittovaltioteatterin nousu ja tuho
scope note: The Federal Theatre -projekti oli 30-luvun talouslaman aikainen ja jälkeinen, Rooseveltin hallituksen sosiaalipoliittisen ohjelman, New Dealin, henkeen toteutettu, julkisin varoin rahoitettu teatteriorganisaatio. Projekti sisälsi myös leimallisesti kokeilullisena foorumina The Living Newspaperin, joka tuotti uusia, Yhdysvaltain ajankohtaisiin, sosiaalisiin ilmiöihin liittyneitä tekstejä ja niiden pohjalta tehtyjä esityksiä
in scheme: conceptscheme
preferred label: Federal Theatre -projekti @fi