matkailualueet
type: Concept
preferred label: tourist areas @en
narrower: Metsäpeuran maa

Metsäpeuran maa
type: Concept
broader: matkailualueet
comment: Metsäpeuran maan luontomatkailu- ja metsätalouden esittelyalue, jossa esitellään yleisölle Suomenselän metsien monipuolista käyttöä eri aikoina.
in scheme: conceptscheme