metonymy
type: Concept
comment: Metonymia on merkitysten vaihtoa ilman muodonmuutosta, kuten tapahtuu metaforassa.
source: http://www.saunalahti.fi/~etaopit/Teletopelius/lyriikka/lyriikka3b1.htm
preferred label: metonymia @fi
preferred label: metonymi @sv
related: metaphor
broader: linguistic phenomena
in scheme: conceptscheme

metaphor
type: Concept
preferred label: metafor @sv
preferred label: metafora @fi
related: metonymy

linguistic phenomena
type: Concept
preferred label: kielelliset ilmiöt @fi
narrower: metonymy