access to employment
type: Concept
preferred label: sysselsättning @sv
preferred label: työllistyminen @fi
narrower: subsidised employment

sheltered work
type: Concept
preferred label: skyddat arbete @sv
preferred label: suojatyö @fi
related: subsidised employment

subsidised employment
type: Concept
preferred label: stödd sysselsättning @sv
preferred label: tuettu työllistyminen @fi
related: sheltered work
in scheme: conceptscheme
source: Lähde: Ala-Kauhaluoma, M. Hallitusti tuetusta työllistymisestä
scope note: Tarkoittaa vammaisten henkilöiden työsuhteista normaalia palkkatyötä tavallisilla työpaikoilla. Työllistyjää tuetaan ennen työhön siirtymistä sekä itse työssä
broader: access to employment