muu rooli
type: Concept
preferred label: annan roll @sv
preferred label: other role @en
narrower: suosikit

suosio
type: Concept
preferred label: popularity @en
preferred label: popularitet @sv
related: suosikit

suosikit
type: Concept
broader: muu rooli
comment: 1) joku joka on jonkun erityisessä suosiossa, lempilapsi, lemmikki; 2) kilpailijasta, joukkueesta tms., jolla etukäteen katsotaan olevan suurimmat mahdollisuudet voittoon
preferred label: favoriter @sv
preferred label: favourites @en
in scheme: conceptscheme
source: Suomen kielen perussanakirja
related: suosio