Akans
type: Concept
broader: africans
comment: väestöryhmä ainakin Norsunluurannikolla ja Ghanassa
alternative label: Akan people
in scheme: conceptscheme
preferred label: akanit @fi
preferred label: akan @sv

africans
type: Concept
preferred label: afrikkalaiset @fi
preferred label: afrikaner @sv
narrower: Akans