konkret icke-levande objekt
type: Concept
preferred label: concrete inanimate object @en
preferred label: konkreettinen eloton objekti @fi
narrower: karosserier

karosserier
type: Concept
broader: konkret icke-levande objekt
in scheme: conceptscheme
preferred label: baskets @en
preferred label: korit (kanto- tai säilytysväline) @fi
source: Suomen kielen perussanakirja
comment: päreistä, pajunvitsoista, muovista tms. tehty, tav. sangallinen kanto- tai säilytysväline, koppa, vasu
scope note: karosserier + korgar = korit