fiske
type: Concept
preferred label: kalastus (pyynti) @fi
preferred label: fishing @en
narrower: elfiske

provfiske
type: Concept
preferred label: exploratory fishing @en
preferred label: koekalastus @fi
related: elfiske

elfiske
type: Concept
preferred label: electrofishing @en
preferred label: sähkökalastus @fi
related: provfiske
scope note: Tarkoittaa kalabiologista tutkimusmenetelmää
scope note: Fiskfaunan i vattendrag undersöks med elfiske.
in scheme: conceptscheme
broader: fiske