serpentine
type: Concept
broader: metamorphic rocks
source: Kielitoimiston sanakirja
comment: pääosin serpentiiniryhmän mineraaleista koostuva kivilaji, joka on syntynyt oliviinikiven muuttumisen tuloksena.
in scheme: conceptscheme
preferred label: serpentiinikivi @fi
preferred label: serpentinsten @sv

metamorphic rocks
type: Concept
preferred label: metamorfiset kivet @fi
narrower: serpentine