lajit (rooli)
type: Concept
preferred label: arter @sv
preferred label: species @en
narrower: maatiaislajikkeet

maatiaislajikkeet
type: Concept
broader: lajit (rooli)
source: EELA
preferred label: native varieties @en
preferred label: endemiska arter @sv
related: kasvit
in scheme: conceptscheme
comment: Maatiaiskasvit ovat lajikkeita, jotka vuosisatojen saatossa ovat luonnonvalinnan seurauksena sopeutuneet paikallisiin kasvuolosuhteisiin. Maatiaiskasveja voi syntyä edelleenkin, eli ne eivät välttämättä ole vanhoja.

kasvit
type: Concept
preferred label: plants @en
preferred label: växter @sv
related: maatiaislajikkeet