botany
type: Concept
preferred label: botanik @sv
preferred label: kasvitiede @fi
narrower: economic botany

economic botany
type: Concept
broader: botany
source: Lähde: Koponen,T.,Ekonominen kasvitiede
scope note: On tieteenala,joka tutkii ihmisen suoraan tai epäsuorasti hyödykseen käyttämiä kasveja. Ekonomisen kasvitieteen kes- keisiä tehtäviä ovat hyötykasvien tunnistaminen (määrittä- minen) ja niiden ominaisuuksien, käytön ja levinneisyyden tutkiminen
in scheme: conceptscheme
preferred label: ekonominen kasvitiede @fi