elokuvaneuvokset
type: Concept
broader: titles
comment: In singular 'elokuvaneuvos', in plural 'elokuvaneuvokset'.
in scheme: conceptscheme

titles
type: Concept
preferred label: titlar @sv
preferred label: arvonimet @fi
narrower: elokuvaneuvokset