registration
type: Concept
preferred label: registrering @sv
preferred label: rekisteröinti @fi
narrower: flagging out

ships sailing under a flag of convenience
type: Concept
preferred label: fartyg under bekvämlighetsflagg @sv
preferred label: mukavuuslippulaivat @fi
related: flagging out

flagging out
type: Concept
preferred label: ulosliputus @fi
preferred label: utflaggning @sv
comment: Ulosliputuksella tarkoitetaan sitä, että aluksen omistava varustamo rekisteröi aluksen jonkin muun kuin oman kotivaltionsa alusrekisteriin.
source: http://www.finlex.fi/fi/esitykset/he/2001/20010234
related: ships sailing under a flag of convenience
broader: registration
in scheme: conceptscheme