faktorer (yrke)
type: Concept
broader: occupations
comment: kirjapainoalalla mestaria vastaava ammattinimike
in scheme: conceptscheme
preferred label: print-shop foremen
preferred label: faktorit @fi

occupations
type: Concept
preferred label: yrken @sv
preferred label: ammatit @fi
narrower: faktorer (yrke)