technical systems
type: Concept
preferred label: tekniset järjestelmät @fi
narrower: suspension

suspension
type: Concept
preferred label: jousitus @fi
preferred label: fjädring @sv
comment: 1) (tekn.) jousittaminen; jousirakenne, jouset; 2) (mus.) jousisoittimen jousen eri käyttötavat
in scheme: conceptscheme
broader: technical systems
source: Suomen kielen perussanakirja