ilmanvaihto
type: Concept
preferred label: ventilation @en
broader: vaihto (tilalle)

toisenlaiseksi muuttaminen
type: Concept
preferred label: förvandling @sv
preferred label: alteration @en
narrower: vaihto (tilalle)

vaihto (tilalle)
type: Concept
scope note: ombyte + växling = vaihto @sv
comment: ottaa, panna tai omaksua jonkin tilalle, sijaan korvaukseksi, tehtävään tms. joku toinen tai jotakin muuta, muuttaa
preferred label: swopping @en
preferred label: växling @sv
alternative label: vaihto
alternative label: vaihtaminen
broader: toisenlaiseksi muuttaminen
source: Suomen kielen perussanakirja
narrower: ilmanvaihto
in scheme: conceptscheme