geologiset kaudet
type: Concept
preferred label: geologiska perioder @sv
preferred label: geological eras @en
related: geokronologia (toiminta)

geokronologia (toiminta)
type: Concept
related: geologiset kaudet
source: Jukka Korpela
comment: tieteenala, joka tutkii maapallon menneisyyden ajoitusta geologisen aineiston perusteella (myös sellaiseen tutkimukseen perustuva ajanjaksoihin jako)
preferred label: geokronologi @sv
preferred label: geochronology @en
alternative label: geokronologia
in scheme: conceptscheme
broader: iänmääritys

iänmääritys
type: Concept
preferred label: datering @sv
preferred label: dating @en
narrower: geokronologia (toiminta)