specialdomstolar
type: Concept
preferred label: special courts @en
preferred label: erikoistuomioistuimet @fi
scope note: Erikoistuomioistuinten nimiä voi käyttää asiasanoina, esim. Markkinatuomioistuin
scope note: Namnen på specialdomstolarna kan användas som ämnesord, t.ex. Marknadsdomstolen
in scheme: conceptscheme
alternative label: erityistuomioistuimet @fi
broader: domstolar
narrower: krigsdomstolar

domstolar
type: Concept
preferred label: courts, judicial system @en
preferred label: tuomioistuimet @fi
narrower: specialdomstolar

krigsdomstolar
type: Concept
preferred label: military courts @en
preferred label: sotatuomioistuimet @fi
broader: specialdomstolar