illnesses
type: Concept
preferred label: taudit @fi
preferred label: sjukdomar @sv
narrower: Cohen syndrome

Cohen syndrome
type: Concept
broader: illnesses
scope note: Suomalaiseen tautiperintöön kuuluva peittyvästi periytyvä oireyhtymä
in scheme: conceptscheme
preferred label: Cohenin oireyhtymä @fi