hemslöjdsläroinrättningar
type: Concept
scope note: Käsi- ja taideteollisuusoppilaitoksista vuoteen 1987 käytetty nimitys
scope note: Benämningen på läroinrättningar för hantverk och konstindustri fram till år 1987
preferred label: kotiteollisuusoppilaitokset @fi
preferred label: handicraft schools @en
in scheme: conceptscheme
broader: occupational schools
related: läroinrättningar för hantverk och konstindustri

occupational schools
type: Concept
preferred label: ammatilliset oppilaitokset @fi
narrower: hemslöjdsläroinrättningar

läroinrättningar för hantverk och konstindustri
type: Concept
preferred label: crafts and design colleges @en
preferred label: käsi- ja taideteollisuusoppilaitokset @fi
related: hemslöjdsläroinrättningar