historism
type: Concept
preferred label: historismi @fi
related: historicism

ideas
type: Concept
preferred label: ideer @sv
preferred label: aatteet @fi
narrower: historicism

historicism
type: Concept
related: historism
source: Lähde: Spectrum tietokeskus
preferred label: historisismi @fi
scope note: Historisismi on näkemys, jonka mukaan maailmanhistorian kulkua määräävät lait, joita on mahdotonta välttää ja jotka johtavat tiettyyn päämäärään
broader: ideas
in scheme: conceptscheme