kasvinosat
type: Concept
preferred label: växternas beståndsdelar @sv
preferred label: parts of plants @en
narrower: emergenssi (kasvinosat)

emergenssi (kasvinosat)
type: Concept
scope note: Sanalla on monia merkityksiä. 1) Esille tuleminen piilosta, äkillisen uuden ilmaantuminen. 2) Uusien ilmiöiden synty monimutkaisten, kokonaisvaltaisten kehitysprosessien kautta. 3) Versokasvien solukkokarva
comment: versokasvien solukkokarva
broader: kasvinosat
in scheme: conceptscheme
preferred label: emergence (parts of plants) @en
alternative label: emergenssi
source: Lähde: CD-Facta