matter
type: Concept
preferred label: aine @fi
preferred label: materia @sv
narrower: biomass

biomass
type: Concept
source: Energiasanasto TSK 16
preferred label: biomassa @sv
in scheme: conceptscheme
related: bioenergy
comment: eloperäinen aine, joka ei ole lainkaan tai on vain vähän muuntunut
broader: matter

bioenergy
type: Concept
preferred label: bioenergi @sv
preferred label: bioenergia @fi
related: biomass