updating training
type: Concept
preferred label: fortbildning @sv
preferred label: täydennyskoulutus @fi
narrower: PD programs -- updating training

PD programs -- updating training
type: Concept
broader: updating training
scope note: PD on lyhenne sanoista professional development
in scheme: conceptscheme
preferred label: PD-ohjelmat -- täydennyskoulutus @fi
preferred label: PD-program (fortbildning) @sv