sodat
type: Concept
preferred label: wars @en
preferred label: krig @sv
narrower: Viron vapaussota

Viron vapaussota
type: Concept
broader: sodat
source: Lähde: Historian suursanakirja
scope note: Virossa v. 1918-20 käyty sota venäläisiä, kommunisteja ja saksalaisia vastaan
in scheme: conceptscheme
preferred label: Estonian War of Independence @en
preferred label: estniska frihetskriget @sv