sijoitus (henkilön aseman muuttaminen)
type: Concept
broader: henkilön aseman muuttaminen
preferred label: placering (arbetsuppgifter) @sv
preferred label: placement (alteration of person's status) @en
source: Kielitoimiston sanakirja
source: Mirja Anttila, Kansalliskirjasto
narrower: uudelleensijoitus (henkilön aseman muuttaminen)
alternative label: sijoitus
comment: jhk toimipaikkaan, työhön, palvelukseen asettamisesta t. ottamisesta, työn järjestämisestä jklle; ei erotu indeksointikäytössä sijoitus_ysa:sta
in scheme: conceptscheme

henkilön aseman muuttaminen
type: Concept
preferred label: alteration of person's status @en
preferred label: ändrande av en persons status @sv
narrower: sijoitus (henkilön aseman muuttaminen)

uudelleensijoitus (henkilön aseman muuttaminen)
type: Concept
preferred label: relocation (alteration of person's status) @en
preferred label: omplacering @sv
broader: sijoitus (henkilön aseman muuttaminen)