building sites
type: Concept
preferred label: tomter @sv
preferred label: tontit @fi
broader: real estates

place defined by human
type: Concept
preferred label: ihmisen määrittämä paikka @fi
narrower: real estates

real estates
type: Concept
source: Kiinteistöliiketoiminnan sanasto
in scheme: conceptscheme
comment: Lainsäädännössä kiinteistöllä tarkoitetaan kiinteistörekisteriin kiinteistönä merkittyä maa- tai vesialueen omistuksen yksikköä.Kiinteistöön kuuluvat sillä sijaitsevat kiinteistön omistajan omistamat rakennukset ja kiinteät laitteet. (Ks. Kiinteistörekisterilaki ja Kiinteistönmuodostumislaki.) Sanaa kiinteistö käytetään puhekielessä yleisesti mm. pelkästä rakennuksesta.
narrower: building sites
broader: place defined by human
preferred label: kiinteistöt @fi
preferred label: fastigheter @sv