sommarvillor
type: Concept
preferred label: villas @en
preferred label: huvilat @fi
narrower: Villa Oivala

Villa Oivala
type: Concept
broader: sommarvillor
scope note: Arkkitehti Oiva Kallion omien piirustustensa mukaan rakennuttama kesäasunto Villingissä
in scheme: conceptscheme