mentaaliset ominaisuudet
type: Concept
preferred label: mentala egenskaper @sv
preferred label: mental qualities @en
narrower: valenssi (mentaaliset ominaisuudet)

valenssi (mentaaliset ominaisuudet)
type: Concept
broader: mentaaliset ominaisuudet
in scheme: conceptscheme
comment: psykologinen kiehtovuus: Kurt Lewinin kenttäteorian mukaan tavoitteena olevan kohteen positiivinen valenssi (+-valenssi) merkitsee kiehtovuutta, negatiivinen valenssi (--valenssi) kohteen vältettävyyttä. Yksilön toiminta suuntautuu +-merkkisiin kohteisiin ja poispäin --merkkisistä kohteista.
alternative label: valenssi
source: Kalliopuska, Mirja 2005: Psykologian sanasto
preferred label: valens @sv
preferred label: valency @en