internal qualities
type: Concept
preferred label: inre egenskaper @sv
preferred label: sisäiset ominaisuudet @fi
narrower: form

sonata form
type: Concept
preferred label: sonaattimuoto @fi
preferred label: sonatform @sv
broader: form

form
type: Concept
in scheme: conceptscheme
preferred label: muoto @fi
comment: 1) fyysisen olion ulkoisten piirteiden kokonaisuus, hahmo, ulkomuoto; 2) olo-, ilmenemismuoto, olotila; asu, hahmo, rakenne; 3) tavasta jolla jokin toiminta teko, ilmiö tms. (ulkonaisesti, käytännössä) ilmenee; 4) kirjallisen tai suullisen esityksen, taideteoksen tms. rakenteellinen kokonaishahmo; 5) lain, asetusten, sääntöjen, vakiintuneen käytännön tms. määräämä, edellyttämä tai niiden mukainen menettelytapa; 6) laji, tyyppi
broader: internal qualities
source: Suomen kielen perussanakirja
narrower: sonata form