arkielämä
type: Concept
preferred label: everyday life @en
preferred label: vardagsliv @sv
related: elämismaailma

elämismaailma
type: Concept
preferred label: levnadsvärld @sv
preferred label: lifeworld @en
in scheme: conceptscheme
related: arkielämä
broader: yhteiskunnalliset ilmiöt
comment: mm. Edmund Husserlin ja Jürgen Habermasin käyttämä filos. nimitys arkielämälle, joko puhtaan teoreettisen ajattelun tai tarkoin ohjelmoidun hallinnollisen systemin vastakohtana
source: WebFacta
alternative label: Lebenswelt

yhteiskunnalliset ilmiöt
type: Concept
preferred label: societal phenomena @en
narrower: elämismaailma