optometrists
type: Concept
preferred label: optometrister @sv
preferred label: optometristit @fi
source: Kielitoimiston sanakirja
comment: näönhuoltoalan määrätutkinnon suorittanut henkilö, joka mm. valmistaa, sovittaa ja huoltaa silmälaseja sekä tekee näöntarkastuksia
broader: role related to action
related: opticians
in scheme: conceptscheme

role related to action
type: Concept
preferred label: sysselsättningsrelaterad roll @sv
preferred label: toimintaan liittyvä rooli @fi
narrower: optometrists

opticians
type: Concept
preferred label: optiker @sv
preferred label: optikot @fi
related: optometrists