bioplastic
type: Concept
preferred label: biomuovi @fi
preferred label: bioplast @sv
broader: biomaterials
broader: plastic
in scheme: conceptscheme
scope note: Tarkoittaa esim. bakteerien ja biojätteiden yhteistuloksena tehtyä muovia

biomaterials
type: Concept
preferred label: biomaterial @sv
preferred label: biomateriaalit @fi
narrower: bioplastic

plastic
type: Concept
preferred label: plast @sv
preferred label: muovi @fi
narrower: bioplastic