virtuaalitodellisuus
type: Concept
preferred label: virtual reality @en
preferred label: virtuell verklighet @sv
related: kyberavaruus

kyberavaruus
type: Concept
related: virtuaalitodellisuus
scope note: Parallell värld där människor kan kommunicera med text, bild och ljud, oberoende av fysiska avstånd, tack vare datorer. Ordet används om webben och olika former av virtuell verklighet. @sv
scope note: Kyberavaruus eli kybertila on ympäristö, joka koostetaan sekä todesta että epätodesta sähköisestä informaatiosta ja liitetään todelliseen maailmaan joko yksisuuntaisten (esim. televisio) tai kaksisuuntaisten (esim. tietokoneet ja puhelin) porttien avulla
alternative label: verkkoavaruus
alternative label: kybertila
source: Lähde: Smith, D., VRML & 3-D
preferred label: cyberspace @en
preferred label: cyberrymd @sv
in scheme: conceptscheme
broader: tekniset tuotokset

tekniset tuotokset
type: Concept
preferred label: technical accomplishments @en
narrower: kyberavaruus