energetics
type: Concept
broader: philosophy
scope note: Energiaa luonnon perustavana tai hallitsevana tekijänä pitävä filosofinen katsomus
in scheme: conceptscheme
preferred label: energetiikka @fi

philosophy
type: Concept
preferred label: filosofia @fi
preferred label: filosofi @sv
narrower: energetics