roll i förhållande till användning
type: Concept
preferred label: role related to use @en
preferred label: käyttöön liittyvä rooli @fi
narrower: surrogat

modersmjölksersättning
type: Concept
preferred label: formulae @en
preferred label: äidinmaidonkorvikkeet @fi
related: surrogat

surrogat
type: Concept
preferred label: surrogates @en
preferred label: korvikkeet @fi
source: Suomen kielen perussanakirja
comment: 1) esine tai asia, joka korvaa jonkin alkuperäisen tai paremman, tällaisen asemesta käytettävä esine tai asia, vastike; 2) (us. teko)aine jota käytetään jonkin alkuperäisen tai paremman asemesta
in scheme: conceptscheme
related: modersmjölksersättning
broader: roll i förhållande till användning