työkomennukset
type: Concept
preferred label: kommenderingar @sv
preferred label: assignments @en
in scheme: conceptscheme
comment: palveluksesta tm. käsketystä tehtävästä vakinaisen palvelus- t. toimipaikan ulkopuolella
source: Kielitoimiston sanakirja
broader: yhteiskunnalliset tapahtumat

yhteiskunnalliset tapahtumat
type: Concept
preferred label: societal events @en
narrower: työkomennukset