skogsskydd
type: Concept
related: bekämpningsmetoder
scope note: Tarkoittaa kasvitautien ja tuhoeläinten torjuntaa metsässä. Indeksoi metsien suojelu luonnonsuojelun kannalta luonnonsuojelu -- metsät ja/tai metsät -- suojelu
scope note: Termen avser bekämpningen av växtsjukdomar och skadedjur i skogen. Indexera skydd av skogen ur naturskyddssynpunkt naturvård : skogar och/eller skogar : skydd
preferred label: forest protection @en
preferred label: metsänsuojelu @fi
in scheme: conceptscheme
broader: växtskydd

bekämpningsmetoder
type: Concept
preferred label: methods of pest control @en
preferred label: torjuntamenetelmät @fi
related: skogsskydd

växtskydd
type: Concept
preferred label: plant protection @en
preferred label: kasvinsuojelu @fi
narrower: skogsskydd