tunnustus (oikeaksi myöntäminen)
type: Concept
broader: keskinäinen toiminta
in scheme: conceptscheme
preferred label: confession @en
alternative label: tunnustus
alternative label: tunnustaminen
comment: myöntää oikeaksi, todeksi, päteväksi, lailliseksi
source: Kielitoimiston sanakirja

keskinäinen toiminta
type: Concept
preferred label: ömsesidig aktivitet @sv
preferred label: mutual activity @en
narrower: tunnustus (oikeaksi myöntäminen)