Jutikkala manor
type: Concept
broader: manors
scope note: Kartano Sääksmäellä (nykyisellä Valkeakoskella)
in scheme: conceptscheme
preferred label: Jutikkala @fi

manors
type: Concept
preferred label: herrgårdar @sv
preferred label: kartanot @fi
narrower: Jutikkala manor