landsbygdsnäringar
type: Concept
preferred label: rural livelihoods @en
preferred label: maaseutuelinkeinot @fi
narrower: trädgårdsskötsel

trädgårdsskötsel
type: Concept
broader: landsbygdsnäringar
scope note: puutarhanhoito + puutarhatalous = trädgårdsskötsel
in scheme: conceptscheme
preferred label: garden economy @en
preferred label: puutarhatalous @fi