sijoitus (tilanteeseen)
type: Concept
in scheme: conceptscheme
broader: tiedollinen luonti
preferred label: placering (kontextualisering) @sv
source: Kielitoimiston sanakirja
source: Mirja Anttila, Kansalliskirjasto
alternative label: sijoitus
comment: jhk aikaan, tilanteeseen, olosuhteisiin tms. liittyen; ei sovellu indeksointikäyttöön tässä merkityksessä, eikä erotu sijoitus_1.stä
related: sijainti

tiedollinen luonti
type: Concept
preferred label: creation related to information @en
preferred label: informationsrelaterat skapande @sv
narrower: sijoitus (tilanteeseen)

sijainti
type: Concept
preferred label: läge @sv
preferred label: location @en
related: sijoitus (tilanteeseen)