ufot
type: Concept
preferred label: ufos @en
preferred label: ufon @sv
related: ufologia (kulttuuriset ilmiöt)

kulttuuriset ilmiöt
type: Concept
preferred label: cultural phenomena @en
narrower: ufologia (kulttuuriset ilmiöt)

ufologia (kulttuuriset ilmiöt)
type: Concept
preferred label: ufologi @sv
preferred label: ufology @en
alternative label: ufouskonnot
alternative label: ufotutkimus
alternative label: ufologia
scope note: Tarkoittaa sekä ufojen tutkimusta että ufoihin uskomista
scope note: Betyder både forskning om och tron på ufon. @sv
broader: kulttuuriset ilmiöt
comment: ufojen tutkiminen
in scheme: conceptscheme
related: ufot