befolkningsstruktur
type: Concept
preferred label: demographic structure @en
preferred label: väestörakenne @fi
related: försörjningskvot

relationer
type: Concept
preferred label: relations @en
preferred label: suhteet @fi
narrower: försörjningskvot

försörjningskvot
type: Concept
preferred label: huoltosuhde @fi
preferred label: dependancy ratio @en
related: befolkningsstruktur
scope note: Tarkoittaa passiivi- ja aktiiviväestön suhdetta. Se voi tarkoittaa joko nuorempien ja vanhempien ikäluokkien suhdetta 15-64 -vuotiaisiin tai työhön osallistumattomien suhdetta työssäkäyviin
scope note: Benämning för antalet icke-sysselsatta i i förhållande till sysselsatta.
in scheme: conceptscheme
broader: relationer