kehykset
type: Concept
preferred label: ramar @sv
preferred label: frames @en
related: kehystys
broader: konkreettinen eloton objekti
source: Suomen kielen perussanakirja
comment: 1) taulun tms. (koriste)lista, raami; 2) puitteet, "pokat"; vanne tms., johon jotakin pingotetaan: kehikko, ulkorunko
in scheme: conceptscheme

kehystys
type: Concept
preferred label: inramning @sv
preferred label: framing @en
related: kehykset

konkreettinen eloton objekti
type: Concept
preferred label: concrete inanimate object @en
preferred label: konkret icke-levande objekt @sv
narrower: kehykset