SGML
type: Concept
alternative label: Standard Generalized Markup Language @fi
broader: metalanguages
in scheme: conceptscheme
scope note: SGML on dokumenttien kuvailustandardi elektronisten tietovarantojen tallennus,- julkaisu- ja tiedonsiirtoprosesseihin
related: HTML

metalanguages
type: Concept
preferred label: metakielet @fi
preferred label: metaspråk @sv
narrower: SGML

HTML
type: Concept
related: SGML