pragmatik
type: Concept
preferred label: pragmatics @en
preferred label: pragmatiikka @fi
related: talakt

talakt
type: Concept
preferred label: speech act @en
preferred label: puheakti @fi
comment: Puheakti (speech act) on sellainen puhejakso, jolla on tietyssä tilanteessa määrätarkoitus ja jonka puhuja ja kuulija yleensä yhdistävät samalla tavalla tiettyyn kontaktitilanteeseen.
broader: talkommunikation
related: pragmatik
in scheme: conceptscheme
source: http://www.internetix.ofw.fi/opinnot/opintojaksot/8kieletkirjallisuus/pragmatiikka/puheakti.html

talkommunikation
type: Concept
preferred label: oral communication @en
preferred label: puheviestintä @fi
narrower: talakt