business intelligence
type: Concept
related: kunskapshantering
scope note: Tarkoittaa kaikkea sellaista organisaation sisäisen ja ulkoisen tiedon hallintaa, jota tarvitaan organisaation liiketoiminnan johtamiseen sekä päivittäisten ratkaisujen tekemiseen. Lyhyesti määriteltynä tarkoittaa yrityksen tietämystä liiketoimintaympäristöstään
in scheme: conceptscheme
broader: economic phenomena

kunskapshantering
type: Concept
preferred label: knowledge management @en
preferred label: tietämyksenhallinta @fi
related: business intelligence

economic phenomena
type: Concept
preferred label: taloudelliset ilmiöt @fi
narrower: business intelligence